BDBM50119765 CHEMBL3616527
SMILES C=CCOn1c(=O)[nH]c2ncn(Cc3ccccc3)c2c1=O
InChI Key InChIKey=BTKSXPOKBAHJCN-UHFFFAOYSA-N
Data  1 IC50
  Tab Delimited (TSV)   2D SDfile   Computed 3D by Vconf -m prep SDfile
Find this compound or compounds like it in BindingDB:
Activity Spreadsheet -- Enzyme Inhibition Constant Data from BindingDB
Found 1 hit for monomerid = 50119765
TargetCCR4-NOT transcription complex subunit 7(Homo sapiens (Human))
University Of Nottingham
Curated by ChEMBL
LigandPNGBDBM50119765(CHEMBL3616527)
Affinity DataIC50: >1.00E+6nM. Assay description: Inhibition of human poly(A)-selective ribonuclease Caf1 by fluorescence-based assay
In DepthDetails ArticlePubMed