BDBM50119844 2-{[2-(6-Amino-purin-9-yl)-ethyl]-methyl-amino}-N-hydroxy-acetamide::CHEMBL105492
SMILES CN(CCn1cnc2c(N)ncnc12)CC(=O)NO
InChI Key InChIKey=VCRGVHWFOOXXIF-UHFFFAOYSA-N
Data  1 IC50
  Tab Delimited (TSV)   2D SDfile   Computed 3D by Vconf -m prep SDfile
Find this compound or compounds like it in BindingDB:
Activity Spreadsheet -- Enzyme Inhibition Constant Data from BindingDB
Found 1 hit for monomerid = 50119844
TargetAdenylate cyclase type 5(Homo sapiens (Human))
Millennium Pharmaceuticals
Curated by ChEMBL
LigandPNGBDBM50119844(2-{[2-(6-Amino-purin-9-yl)-ethyl]-methyl-amino}-N-...)
Affinity DataIC50:  1.53E+4nM. Assay description: Inhibition of recombinant human adenylate cyclase 5 expressed in HEK293 cells
In DepthDetails ArticlePubMed