BDBM50126078 (3-{2-[(R)-2-(3-Chloro-phenyl)-2-hydroxy-ethylamino]-propyl}-1H-indol-7-yloxy)-acetic acid::CHEMBL282190
SMILES CC(Cc1c[nH]c2c(OCC(O)=O)cccc12)NC[C@H](O)c1cccc(Cl)c1
InChI Key InChIKey=FHEYFIGWYQJVDR-UWBLVGDVSA-N
Data  4 EC50
  Tab Delimited (TSV)   2D SDfile   Computed 3D by Vconf -m prep SDfile
Find this compound or compounds like it in BindingDB:
Activity Spreadsheet -- Enzyme Inhibition Constant Data from BindingDB
Found 4 hits for monomerid = 50126078
TargetBeta-3 adrenergic receptor(Homo sapiens (Human))
Dainippon Pharmaceutical
Curated by ChEMBL
LigandPNGBDBM50126078((3-{2-[(R)-2-(3-Chloro-phenyl)-2-hydroxy-ethylamin...)
Affinity DataEC50:  0.110nM. Assay description: Agonism of recombinant human beta-3 adrenergic receptor assayed by measuring cAMP accumulation in CHO cells expressing beta3-AR
In DepthDetails ArticlePubMed
TargetBeta-2 adrenergic receptor(Homo sapiens (Human))
National Institute Of Pharmaceutical Education And Research
Curated by ChEMBL
LigandPNGBDBM50126078((3-{2-[(R)-2-(3-Chloro-phenyl)-2-hydroxy-ethylamin...)
Affinity DataEC50:  13nM. Assay description: Agonist activity at Homo sapiens (human) beta2 adrenoreceptor
In DepthDetails ArticlePubMed
TargetBeta-1 adrenergic receptor(Homo sapiens (Human))
National Institute Of Pharmaceutical Education And Research
Curated by ChEMBL
LigandPNGBDBM50126078((3-{2-[(R)-2-(3-Chloro-phenyl)-2-hydroxy-ethylamin...)
Affinity DataEC50:  6.40nM. Assay description: Agonist activity at Homo sapiens (human) beta1 adrenoreceptor
In DepthDetails ArticlePubMed
TargetBeta-3 adrenergic receptor(Homo sapiens (Human))
Dainippon Pharmaceutical
Curated by ChEMBL
LigandPNGBDBM50126078((3-{2-[(R)-2-(3-Chloro-phenyl)-2-hydroxy-ethylamin...)
Affinity DataEC50:  0.0620nM. Assay description: Agonist activity at Homo sapiens (human) beta3 adrenoreceptor
In DepthDetails ArticlePubMed