BDBM50128202 (1R,3S)-2-[3-(6-Amino-purin-9-yl)-cyclopentyl]-N-hydroxy-acetamide::CHEMBL420363
SMILES Nc1ncnc2n(cnc12)[C@H]1CC[C@@H](CC(=O)NO)C1
InChI Key InChIKey=NITZEITXMRNCEG-SFYZADRCSA-N
Data  1 IC50
  Tab Delimited (TSV)   2D SDfile   Computed 3D by Vconf -m prep SDfile
Find this compound or compounds like it in BindingDB:
Activity Spreadsheet -- Enzyme Inhibition Constant Data from BindingDB
Found 1 hit for monomerid = 50128202
TargetAdenylate cyclase type 5(Homo sapiens (Human))
Millennium Pharmaceuticals
Curated by ChEMBL
LigandPNGBDBM50128202((1R,3S)-2-[3-(6-Amino-purin-9-yl)-cyclopentyl]-N-h...)
Affinity DataIC50:  2.51E+4nM. Assay description: Inhibitory activity against recombinant human adenylate cyclase 5 expressed in HEK293 cells.
In DepthDetails ArticlePubMed