BDBM50130125 (R)-2-[Benzo[1,3]dioxol-5-ylmethyl-(4-methoxy-benzenesulfonyl)-amino]-pentanedioic acid 1-hydroxyamide 5-[(pyridin-3-ylmethyl)-amide]::CHEMBL80407
SMILES COc1ccc(cc1)S(=O)(=O)N(Cc1ccc2OCOc2c1)[C@H](CCC(=O)NCc1cccnc1)C(=O)NO
InChI Key InChIKey=UCRXDYKRRNRKMP-JOCHJYFZSA-N
Data  1 KI
  Tab Delimited (TSV)   2D SDfile   Computed 3D by Vconf -m prep SDfile
Find this compound or compounds like it in BindingDB:
Activity Spreadsheet -- Enzyme Inhibition Constant Data from BindingDB
Found 1 hit for monomerid = 50130125
TargetBone morphogenetic protein 1(Homo sapiens (Human))
Combichem
Curated by ChEMBL
LigandPNGBDBM50130125((R)-2-[Benzo[1,3]dioxol-5-ylmethyl-(4-methoxy-benz...)
Affinity DataKi:  160nM. Assay description: Ability to inhibit procollagen C-terminal proteinase (PCP) tested in vitro
In DepthDetails ArticlePubMed