BDBM50130567 2-(4-Cyclopropylmethyl-piperazin-1-yl)-5H-benzo[c][1,5]naphthyridin-6-one; compound with methanesulfonic acid::CHEMBL108431
SMILES O=c1[nH]c2ccc(nc2c2ccccc12)N1CCN(CC2CC2)CC1
InChI Key InChIKey=VRXNWWVVSARIFG-UHFFFAOYSA-N
Data  1 IC50
  Tab Delimited (TSV)   2D SDfile   Computed 3D by Vconf -m prep SDfile
Find this compound or compounds like it in BindingDB:
Activity Spreadsheet -- Enzyme Inhibition Constant Data from BindingDB
Found 1 hit for monomerid = 50130567
TargetPoly [ADP-ribose] polymerase 1(Homo sapiens (Human))
Guilford Pharmaceuticals
Curated by ChEMBL
LigandPNGBDBM50130567(2-(4-Cyclopropylmethyl-piperazin-1-yl)-5H-benzo[c]...)
Affinity DataIC50:  71nM. Assay description: Inhibitory activity against Poly (ADP-ribose) polymerase 1
In DepthDetails ArticlePubMed