BDBM50130569 CHEMBL542927::N-(6-Oxo-5,6-dihydro-benzo[c][1,5]naphthyridin-2-yl)-2-piperidin-1-yl-acetamide; hydrochloride
SMILES O=C(CN1CCCCC1)Nc1ccc2[nH]c(=O)c3ccccc3c2n1
InChI Key InChIKey=PJPHOHZVHAHBCW-UHFFFAOYSA-N
Data  1 IC50
  Tab Delimited (TSV)   2D SDfile   Computed 3D by Vconf -m prep SDfile
Find this compound or compounds like it in BindingDB:
Activity Spreadsheet -- Enzyme Inhibition Constant Data from BindingDB
Found 1 hit for monomerid = 50130569
TargetPoly [ADP-ribose] polymerase 1(Homo sapiens (Human))
Guilford Pharmaceuticals
Curated by ChEMBL
LigandPNGBDBM50130569(CHEMBL542927 | N-(6-Oxo-5,6-dihydro-benzo[c][1,5]n...)
Affinity DataIC50:  150nM. Assay description: Inhibitory activity against Poly (ADP-ribose) polymerase 1
In DepthDetails ArticlePubMed