BDBM50130592 2-(4-Isopropyl-piperazin-1-yl)-N-(6-oxo-5,6-dihydro-benzo[c][1,5]naphthyridin-2-yl)-acetamide; hydrochloride::CHEMBL543393
SMILES CC(C)N1CCN(CC(=O)Nc2ccc3[nH]c(=O)c4ccccc4c3n2)CC1
InChI Key InChIKey=PZUGCMLEYWVGJY-UHFFFAOYSA-N
Data  1 IC50
  Tab Delimited (TSV)   2D SDfile   Computed 3D by Vconf -m prep SDfile
Find this compound or compounds like it in BindingDB:
Activity Spreadsheet -- Enzyme Inhibition Constant Data from BindingDB
Found 1 hit for monomerid = 50130592
TargetPoly [ADP-ribose] polymerase 1(Homo sapiens (Human))
Guilford Pharmaceuticals
Curated by ChEMBL
LigandPNGBDBM50130592(2-(4-Isopropyl-piperazin-1-yl)-N-(6-oxo-5,6-dihydr...)
Affinity DataIC50:  277nM. Assay description: Inhibitory activity against Poly (ADP-ribose) polymerase 1
In DepthDetails ArticlePubMed