BDBM50130655 2-Chloro-4-[5-(4-fluoro-phenyl)-2-methylsulfanyl-3H-imidazol-4-yl]-pyridine::2-chloro-4-(4-(4-fluorophenyl)-2-(methylthio)-1H-imidazol-5-yl)pyridine::CHEMBL113060
SMILES CSc1nc(c([nH]1)-c1ccc(F)cc1)-c1ccnc(Cl)c1
InChI Key InChIKey=IVMWZPRCCDVEDY-UHFFFAOYSA-N
Data  3 IC50
  Tab Delimited (TSV)   2D SDfile   Computed 3D by Vconf -m prep SDfile
Find this compound or compounds like it in BindingDB:
Activity Spreadsheet -- Enzyme Inhibition Constant Data from BindingDB
Found 3 hits for monomerid = 50130655
TargetMitogen-activated protein kinase 14(Homo sapiens (Human))
Eberhard Karls University Tuebingen
Curated by ChEMBL
LigandPNGBDBM50130655(2-Chloro-4-[5-(4-fluoro-phenyl)-2-methylsulfanyl-3...)
Affinity DataIC50:  1.04E+3nM. Assay description: Inhibition of p38alpha
In DepthDetails ArticlePubMed
TargetMitogen-activated protein kinase 11/12/13/14(Homo sapiens (Human))
Eberhard-Karls-University T£Bingen
Curated by ChEMBL
LigandPNGBDBM50130655(2-Chloro-4-[5-(4-fluoro-phenyl)-2-methylsulfanyl-3...)
Affinity DataIC50:  350nM. Assay description: Inhibitory activity against induction of IL-1-beta release in PBMCs
In DepthDetails ArticlePubMed
TargetMitogen-activated protein kinase 11/12/13/14(Homo sapiens (Human))
Eberhard-Karls-University T£Bingen
Curated by ChEMBL
LigandPNGBDBM50130655(2-Chloro-4-[5-(4-fluoro-phenyl)-2-methylsulfanyl-3...)
Affinity DataIC50:  2.20E+3nM. Assay description: Inhibitory activity against TNF-alpha release in PBM cells
In DepthDetails ArticlePubMed