BDBM50133364 CHEMBL134566::N-[2-Furan-2-yl-8-(3-phenyl-propyl)-8H-pyrazolo[4,3-e][1,2,4]triazolo[1,5-c]pyrimidin-5-yl]-2-phenyl-acetamide
SMILES O=C(Cc1ccccc1)Nc1nc2nn(CCCc3ccccc3)cc2c2nc(nn12)-c1ccco1
InChI Key InChIKey=BWLSCOHOGMFEIU-UHFFFAOYSA-N
Data  5 KI  1 IC50
  Tab Delimited (TSV)   2D SDfile   Computed 3D by Vconf -m prep SDfile
Find this compound or compounds like it in BindingDB:
Activity Spreadsheet -- Enzyme Inhibition Constant Data from BindingDB
Found 6 hits for monomerid = 50133364
TargetAdenosine receptor A2b(Homo sapiens (Human))
Università
Curated by ChEMBL
LigandPNGBDBM50133364(CHEMBL134566 | N-[2-Furan-2-yl-8-(3-phenyl-propyl)...)
Affinity DataKi:  35nM. Assay description: Displacement of [3H]-DPCPX from human adenosine A2B receptor expressed in HEK-293 cells
In DepthDetails ArticlePubMed
TargetAdenosine receptor A2a(Homo sapiens (Human))
Università
Curated by ChEMBL
LigandPNGBDBM50133364(CHEMBL134566 | N-[2-Furan-2-yl-8-(3-phenyl-propyl)...)
Affinity DataKi:  60nM. Assay description: Displacement of [3H]-ZM-241,385 from human adenosine A2A receptors expressed in HEK-293 cells
In DepthDetails ArticlePubMed
TargetAdenosine receptor A1(Homo sapiens (Human))
Università
Curated by ChEMBL
LigandPNGBDBM50133364(CHEMBL134566 | N-[2-Furan-2-yl-8-(3-phenyl-propyl)...)
Affinity DataKi:  75nM. Assay description: Displacement of [3H]-DPCPX from human Adenosine A1 receptor expressed in CHO cells
In DepthDetails ArticlePubMed
TargetAdenosine receptor A3(Homo sapiens (Human))
National University Of Singapore
Curated by ChEMBL
LigandPNGBDBM50133364(CHEMBL134566 | N-[2-Furan-2-yl-8-(3-phenyl-propyl)...)
Affinity DataKi:  121nM. Assay description: Antagonist activity at human adenosine A3 receptor
In DepthDetails ArticlePubMed
TargetAdenosine receptor A3(Homo sapiens (Human))
National University Of Singapore
Curated by ChEMBL
LigandPNGBDBM50133364(CHEMBL134566 | N-[2-Furan-2-yl-8-(3-phenyl-propyl)...)
Affinity DataKi:  121nM. Assay description: Displacement of [3H]-MRE3008-F20 from human A3 receptors expressed in HEK-293 cells
In DepthDetails ArticlePubMed
TargetAdenosine receptor A2b(Homo sapiens (Human))
Università
Curated by ChEMBL
LigandPNGBDBM50133364(CHEMBL134566 | N-[2-Furan-2-yl-8-(3-phenyl-propyl)...)
Affinity DataIC50:  250nM. Assay description: Inhibitory activity against NECA stimulated cAMP accumulation in CHO cells expressing human adenosine A2B receptor
In DepthDetails ArticlePubMed