BDBM50135582 (S)-N-((S)-5-Benzo[1,3]dioxol-5-yl-2-oxo-2,3-dihydro-1H-benzo[e][1,4]diazepin-3-yl)-3-(3,4-difluoro-phenyl)-2-methyl-propionamide::CHEMBL336071
SMILES C[C@@H](Cc1ccc(F)c(F)c1)C(=O)N[C@H]1N=C(c2ccc3OCOc3c2)c2ccccc2NC1=O
InChI Key InChIKey=OLFLSCYCOPOYSB-LFPIHBKWSA-N
Data  1 IC50
  Tab Delimited (TSV)   2D SDfile   Computed 3D by Vconf -m prep SDfile
Find this compound or compounds like it in BindingDB:
Activity Spreadsheet -- Enzyme Inhibition Constant Data from BindingDB
Found 1 hit for monomerid = 50135582
LigandPNGBDBM50135582((S)-N-((S)-5-Benzo[1,3]dioxol-5-yl-2-oxo-2,3-dihyd...)
Affinity DataIC50:  1.80nM. Assay description: In vitro inhibition of gamma secretase.
In DepthDetails ArticlePubMed