BDBM50135584 (S)-3-(3,4-Difluoro-phenyl)-2-methyl-N-[(S)-1-methyl-2-oxo-5-(4-oxo-4H-chromen-7-yl)-2,3-dihydro-1H-benzo[e][1,4]diazepin-3-yl]-propionamide::CHEMBL133237
SMILES C[C@@H](Cc1ccc(F)c(F)c1)C(=O)N[C@H]1N=C(c2ccc3c(c2)occc3=O)c2ccccc2N(C)C1=O
InChI Key InChIKey=AHSBZPJSUYPXJE-RKOGDMNLSA-N
Data  1 IC50
  Tab Delimited (TSV)   2D SDfile   Computed 3D by Vconf -m prep SDfile
Find this compound or compounds like it in BindingDB:
Activity Spreadsheet -- Enzyme Inhibition Constant Data from BindingDB
Found 1 hit for monomerid = 50135584
LigandPNGBDBM50135584((S)-3-(3,4-Difluoro-phenyl)-2-methyl-N-[(S)-1-meth...)
Affinity DataIC50:  1.20nM. Assay description: In vitro inhibition of gamma secretase.
In DepthDetails ArticlePubMed