BDBM50135891 CHEMBL346622::[4-Amino-5-(3-bromo-phenyl)-7-thiophen-2-yl-pyrido[2,3-d]pyrimidin-6-yl]-acetic acid methyl ester
SMILES COC(=O)Cc1c(nc2ncnc(N)c2c1-c1cccc(Br)c1)-c1cccs1
InChI Key InChIKey=QHGWHYZVJHJJSE-UHFFFAOYSA-N
Data  2 IC50
  Tab Delimited (TSV)   2D SDfile   Computed 3D by Vconf -m prep SDfile
Find this compound or compounds like it in BindingDB:
Activity Spreadsheet -- Enzyme Inhibition Constant Data from BindingDB
Found 2 hits for monomerid = 50135891
TargetAdenosine kinase(Homo sapiens (Human))
Abbott Laboratories
Curated by ChEMBL
LigandPNGBDBM50135891(CHEMBL346622 | [4-Amino-5-(3-bromo-phenyl)-7-thiop...)
Affinity DataIC50:  163nM. Assay description: Inhibition of adenosine kinase activity in IMR-32 human neuroblastoma cells
In DepthDetails ArticlePubMed
TargetAdenosine kinase(Rattus norvegicus (rat))
Abbott Laboratories
Curated by ChEMBL
LigandPNGBDBM50135891(CHEMBL346622 | [4-Amino-5-(3-bromo-phenyl)-7-thiop...)
Affinity DataIC50:  3nM. Assay description: Inhibition adenosine kinase activity in rat brain in vitro
In DepthDetails ArticlePubMed