BDBM50138625 2-{4-[(R)-2-Hydroxy-3-(2-methyl-benzothiazol-5-yloxy)-propyl]-piperazin-1-yl}-N-(4-phenoxy-phenyl)-acetamide::CHEMBL422135
SMILES Cc1nc2cc(OC[C@H](O)CN3CCN(CC(=O)Nc4ccc(Oc5ccccc5)cc4)CC3)ccc2s1
InChI Key InChIKey=FXBLMSKMRFBSIL-HSZRJFAPSA-N
Data  1 IC50
  Tab Delimited (TSV)   2D SDfile   Computed 3D by Vconf -m prep SDfile
Find this compound or compounds like it in BindingDB:
Activity Spreadsheet -- Enzyme Inhibition Constant Data from BindingDB
Found 1 hit for monomerid = 50138625
TargetPeroxisomal acyl-coenzyme A oxidase 1(Rattus norvegicus)
Cv Therapeutics
Curated by ChEMBL
LigandPNGBDBM50138625(2-{4-[(R)-2-Hydroxy-3-(2-methyl-benzothiazol-5-ylo...)
Affinity DataIC50:  330nM. Assay description: Inhibitory activity against Palmitoyl-CoA oxidase to inhibit rat heart mitochondrial Palmitoyl-CoA oxidation.
In DepthDetails ArticlePubMed