BDBM50138627 2-{4-[(R)-2-Hydroxy-3-(2-methyl-benzothiazol-5-yloxy)-propyl]-piperazin-1-yl}-N-(3-phenoxy-phenyl)-acetamide::CHEMBL152932
SMILES Cc1nc2cc(OC[C@H](O)CN3CCN(CC(=O)Nc4cccc(Oc5ccccc5)c4)CC3)ccc2s1
InChI Key InChIKey=BCKICEBQWAXWQN-HSZRJFAPSA-N
Data  1 IC50
  Tab Delimited (TSV)   2D SDfile   Computed 3D by Vconf -m prep SDfile
Find this compound or compounds like it in BindingDB:
Activity Spreadsheet -- Enzyme Inhibition Constant Data from BindingDB
Found 1 hit for monomerid = 50138627
TargetPeroxisomal acyl-coenzyme A oxidase 1(Rattus norvegicus)
Cv Therapeutics
Curated by ChEMBL
LigandPNGBDBM50138627(2-{4-[(R)-2-Hydroxy-3-(2-methyl-benzothiazol-5-ylo...)
Affinity DataIC50:  360nM. Assay description: Inhibitory activity against Palmitoyl-CoA oxidase to inhibit rat heart mitochondrial Palmitoyl-CoA oxidation.
In DepthDetails ArticlePubMed