BDBM50139937 CHEMBL274906::N-Hydroxy-3-[1-methyl-4-(5-phenyl-pentanoyl)-1H-pyrrol-2-yl]-acrylamide
SMILES Cn1cc(cc1C=CC(=O)NO)C(=O)CCCCc1ccccc1
InChI Key InChIKey=QNIOUMVBOGKRQV-UHFFFAOYSA-N
Data  2 IC50
  Tab Delimited (TSV)   2D SDfile   Computed 3D by Vconf -m prep SDfile
Find this compound or compounds like it in BindingDB:
Activity Spreadsheet -- Enzyme Inhibition Constant Data from BindingDB
Found 2 hits for monomerid = 50139937
TargetHistone deacetylase 2b(Zea mays)
Sapienza University Of Rome
Curated by ChEMBL
LigandPNGBDBM50139937(CHEMBL274906 | N-Hydroxy-3-[1-methyl-4-(5-phenyl-p...)
Affinity DataIC50:  110nM. Assay description: Concentration required for inhibition of histone deacetylase HD2 in vitro.Checked by Author
In DepthDetails ArticlePubMed
TargetHistone deacetylase 2b(Zea mays)
Sapienza University Of Rome
Curated by ChEMBL
LigandPNGBDBM50139937(CHEMBL274906 | N-Hydroxy-3-[1-methyl-4-(5-phenyl-p...)
Affinity DataIC50:  110nM. Assay description: Inhibitory concentration against histone deacetylase HD2 enzyme.Checked by Author
In DepthDetails ArticlePubMed