BDBM50139944 CHEMBL12890::N-Hydroxy-3-[1-methyl-4-(naphthalene-1-carbonyl)-1H-pyrrol-2-yl]-acrylamide
SMILES Cn1cc(cc1\C=C\C(=O)NO)C(=O)c1cccc2ccccc12
InChI Key InChIKey=SATKHECYBIEDEL-MDZDMXLPSA-N
Data  2 IC50
  Tab Delimited (TSV)   2D SDfile   Computed 3D by Vconf -m prep SDfile
Find this compound or compounds like it in BindingDB:
Activity Spreadsheet -- Enzyme Inhibition Constant Data from BindingDB
Found 2 hits for monomerid = 50139944
TargetHistone deacetylase 2b(Zea mays)
Sapienza University Of Rome
Curated by ChEMBL
LigandPNGBDBM50139944(CHEMBL12890 | N-Hydroxy-3-[1-methyl-4-(naphthalene...)
Affinity DataIC50:  144nM. Assay description: Concentration required for inhibition of histone deacetylase HD2 in vitro.Checked by Author
In DepthDetails ArticlePubMed
TargetHistone deacetylase 2b(Zea mays)
Sapienza University Of Rome
Curated by ChEMBL
LigandPNGBDBM50139944(CHEMBL12890 | N-Hydroxy-3-[1-methyl-4-(naphthalene...)
Affinity DataIC50:  145nM. Assay description: Inhibitory concentration against histone deacetylase HD2 enzyme.Checked by Author
In DepthDetails ArticlePubMed