BDBM50139945 CHEMBL273731::N-Hydroxy-3-[1-methyl-4-(naphthalene-2-carbonyl)-1H-pyrrol-2-yl]-acrylamide
SMILES Cn1cc(cc1\C=C\C(=O)NO)C(=O)c1ccc2ccccc2c1
InChI Key InChIKey=LPNBODJGOBHLOI-CMDGGOBGSA-N
Data  2 IC50
  Tab Delimited (TSV)   2D SDfile   Computed 3D by Vconf -m prep SDfile
Find this compound or compounds like it in BindingDB:
Activity Spreadsheet -- Enzyme Inhibition Constant Data from BindingDB
Found 2 hits for monomerid = 50139945
TargetHistone deacetylase 2b(Zea mays)
Sapienza University Of Rome
Curated by ChEMBL
LigandPNGBDBM50139945(CHEMBL273731 | N-Hydroxy-3-[1-methyl-4-(naphthalen...)
Affinity DataIC50:  115nM. Assay description: Concentration required for inhibition of histone deacetylase HD2 in vitro.Checked by Author
In DepthDetails ArticlePubMed
TargetHistone deacetylase 2b(Zea mays)
Sapienza University Of Rome
Curated by ChEMBL
LigandPNGBDBM50139945(CHEMBL273731 | N-Hydroxy-3-[1-methyl-4-(naphthalen...)
Affinity DataIC50:  115nM. Assay description: Concentration required for inhibition of histone deacetylase HD2 in vitro.Checked by Author
In DepthDetails ArticlePubMed