BDBM50140643 1-Cyclopentyl-6-(4-ethoxy-phenyl)-4,5,7-trimethyl-6H-pyrrolo[3,4-d]pyridazine::CHEMBL283359
SMILES CCOc1ccc(cc1)-n1c(C)c2c(C)nnc(C3CCCC3)c2c1C
InChI Key InChIKey=SKWBKIZBGPUXHN-UHFFFAOYSA-N
Data  1 IC50
  Tab Delimited (TSV)   2D SDfile   Computed 3D by Vconf -m prep SDfile
Find this compound or compounds like it in BindingDB:
Activity Spreadsheet -- Enzyme Inhibition Constant Data from BindingDB
Found 1 hit for monomerid = 50140643
TargetVoltage-dependent calcium channel subunit alpha-2/delta-1(Homo sapiens (Human))
Merck Research Laboratories
Curated by ChEMBL
LigandPNGBDBM50140643(1-Cyclopentyl-6-(4-ethoxy-phenyl)-4,5,7-trimethyl-...)
Affinity DataIC50:  185nM. Assay description: Binding affinity for huamn alpha2-delta1 subunit of voltage gated calcium channel over-expressed in A710 cell membranes using [3H]-gabapentin
In DepthDetails ArticlePubMed