BDBM50140857 4-{4-[2-(3,4-Difluoro-phenyl)-ethyl]-piperazin-1-yl}-5-methyl-2-morpholin-4-ylmethyl-5H-pyrimido[5,4-b]indole-9-carboxylic acid amide::CHEMBL439727
SMILES Cn1c2cccc(C(N)=O)c2c2nc(CN3CCOCC3)nc(N3CCN(CCc4ccc(F)c(F)c4)CC3)c12
InChI Key InChIKey=VMVGGLFKABPLBA-UHFFFAOYSA-N
Data  6 IC50
  Tab Delimited (TSV)   2D SDfile   Computed 3D by Vconf -m prep SDfile
Find this compound or compounds like it in BindingDB:
Activity Spreadsheet -- Enzyme Inhibition Constant Data from BindingDB
Found 6 hits for monomerid = 50140857
TargetMultidrug resistance-associated protein 1(Homo sapiens (Human))
Xenova
Curated by ChEMBL
LigandPNGBDBM50140857(4-{4-[2-(3,4-Difluoro-phenyl)-ethyl]-piperazin-1-y...)
Affinity DataIC50:  230nM. Assay description: In vitro inhibitory activity against MRP1 (Multidrug resistance associated protein 1) expressed in COR.L23/R cell line in accumulation assay
In DepthDetails ArticlePubMed
TargetMultidrug resistance-associated protein 1(Homo sapiens (Human))
Xenova
Curated by ChEMBL
LigandPNGBDBM50140857(4-{4-[2-(3,4-Difluoro-phenyl)-ethyl]-piperazin-1-y...)
Affinity DataIC50:  29nM. Assay description: Inhibitory activity against MRP1 (Multidrug resistance associated protein 1) expressed in COR.L23/R cell line in single-dose potentiation assay
In DepthDetails ArticlePubMed
TargetATP-dependent translocase ABCB1(Mus musculus (Mouse))
Xenova
Curated by ChEMBL
LigandPNGBDBM50140857(4-{4-[2-(3,4-Difluoro-phenyl)-ethyl]-piperazin-1-y...)
Affinity DataIC50:  608nM. Assay description: Inhibitory activity against P-glycoprotein expressed in murine mammary carcinoma (EMT6/AR1.0 cell line) in single-dose potentiation assay
In DepthDetails ArticlePubMed
TargetMultidrug resistance-associated protein 1(Homo sapiens (Human))
Xenova
Curated by ChEMBL
LigandPNGBDBM50140857(4-{4-[2-(3,4-Difluoro-phenyl)-ethyl]-piperazin-1-y...)
Affinity DataIC50: <250nM. Assay description: Inhibitory concentration against multidrug resistance associated protein 1
In DepthDetails ArticlePubMed
TargetCytochrome P450 3A4(Homo sapiens (Human))
Xenova
Curated by ChEMBL
LigandPNGBDBM50140857(4-{4-[2-(3,4-Difluoro-phenyl)-ethyl]-piperazin-1-y...)
Affinity DataIC50:  3.13E+4nM. Assay description: Inhibitory activity against cytochrome P450 3A4
In DepthDetails ArticlePubMed
TargetATP-dependent translocase ABCB1(Mus musculus (Mouse))
Xenova
Curated by ChEMBL
LigandPNGBDBM50140857(4-{4-[2-(3,4-Difluoro-phenyl)-ethyl]-piperazin-1-y...)
Affinity DataIC50: >4.00E+4nM. Assay description: In vitro inhibitory activity against P-glycoprotein expressed in murine mammary carcinoma (EMT6/AR1.0 cell line) in accumulation assay
In DepthDetails ArticlePubMed