BDBM50143748 (2,6-Dimethyl-phenyl)-(4-diphenylamino-[1,4']bipiperidinyl-1'-yl)-methanone::CHEMBL58101
SMILES Cc1cccc(C)c1C(=O)N1CCC(CC1)N1CCC(CC1)N(c1ccccc1)c1ccccc1
InChI Key InChIKey=KWPAQVVTTPTSTI-UHFFFAOYSA-N
Data  3 IC50
  Tab Delimited (TSV)   2D SDfile   Computed 3D by Vconf -m prep SDfile
Find this compound or compounds like it in BindingDB:
Activity Spreadsheet -- Enzyme Inhibition Constant Data from BindingDB
Found 3 hits for monomerid = 50143748
TargetC-C chemokine receptor type 5(Homo sapiens (Human))
Novartis Institutes For Biomedical Research
Curated by ChEMBL
LigandPNGBDBM50143748((2,6-Dimethyl-phenyl)-(4-diphenylamino-[1,4']bipip...)
Affinity DataIC50:  26nM. Assay description: Antagonistic activity against monkey C-C chemokine receptor type 5.
In DepthDetails ArticlePubMed
TargetC-C chemokine receptor type 5(Homo sapiens (Human))
Novartis Institutes For Biomedical Research
Curated by ChEMBL
LigandPNGBDBM50143748((2,6-Dimethyl-phenyl)-(4-diphenylamino-[1,4']bipip...)
Affinity DataIC50:  11.1nM. Assay description: Antagonistic activity against human C-C chemokine receptor type 5.
In DepthDetails ArticlePubMed
TargetC-C chemokine receptor type 5(Homo sapiens (Human))
Novartis Institutes For Biomedical Research
Curated by ChEMBL
LigandPNGBDBM50143748((2,6-Dimethyl-phenyl)-(4-diphenylamino-[1,4']bipip...)
Affinity DataIC50:  61nM. Assay description: Rises in intracellular [Ca2+] levels by using [Ca2+] sensitive Fluo4 dye in C-C chemokine receptor type 5-transfected CHO cells.
In DepthDetails ArticlePubMed