BDBM50144871 CHEMBL428134
SMILES CC(C)C[C@@H]1NC(=O)[C@@H]2CSSSSC[C@@H]3NC(=O)[C@@H](NC(=O)[C@H](C)NC(=O)[C@H](C)NC(=O)[C@@H]4CCCN4C(=O)[C@H](CC(O)=O)NC(=O)[C@H](CSSSSC[C@H](NNC(C)=O)C(=O)N[C@@H](C(C)C)C(=O)N[C@@H](CCCN=C(N)N)C(=O)N[C@@H](CC(C)C)C(=O)N[C@@H](Cc4c[nH]cn4)C(=O)N[C@@H](CCC(O)=O)C(=O)N[C@@H](CO)C(=O)N2)NC(=O)[C@H](CSSSSC[C@H](NC(=O)[C@H](Cc2ccc(O)cc2)NC(=O)[C@@H]2CSSSSC[C@H](NC(=O)[C@H](Cc4ccc(O)cc4)NC3=O)C(=O)N[C@@H](CCCN=C(N)N)C(=O)N[C@@H](Cc3ccccc3)C(=O)N[C@@H](Cc3ccccc3)C(=O)N[C@@H](CC(N)=O)C(=O)N[C@@H](C)C(=O)N[C@@H](Cc3ccccc3)C(=O)N2)C(=O)N[C@@H](CCCN=C(N)N)C(=O)C(N)=O)NC(=O)[C@@H]2CCCN2C(=O)[C@@H](NC(=O)[C@H](CCC(N)=O)NC(=O)[C@H](CCC(N)=O)NC(=O)CNC1=O)C(C)C)[C@@H](C)O
InChI Key InChIKey=MYQDHXIMPMJXBQ-MNQAAEEESA-N
Data  2 IC50  2 Kd  2 EC50
  Tab Delimited (TSV)   2D SDfile   Computed 3D by Vconf -m prep SDfile
Find this compound or compounds like it in BindingDB:
Activity Spreadsheet -- Enzyme Inhibition Constant Data from BindingDB
Found 6 hits for monomerid = 50144871
TargetMelanocyte-stimulating hormone receptor(Mus musculus)
University Of Florida
Curated by ChEMBL
LigandPNGBDBM50144871(CHEMBL428134)
Affinity DataEC50: >1.00E+5nM. Assay description: Effective concentration against mouse Melanocortin 1 receptor
In DepthDetails ArticlePubMed
TargetMelanocortin receptor 4(Mus musculus)
University Of Florida
Curated by ChEMBL
LigandPNGBDBM50144871(CHEMBL428134)
Affinity DataIC50:  4.74nM. Assay description: Inhibitory concentration towards melanocortin MC4 receptor by displacing radioligand [125I]-hAGRP(82-132)
In DepthDetails ArticlePubMed
TargetMelanocortin receptor 4(Mus musculus)
University Of Florida
Curated by ChEMBL
LigandPNGBDBM50144871(CHEMBL428134)
Affinity DataKd:  3.47nM. Assay description: Effective concentration against mouse melanocortin MC4 receptor
In DepthDetails ArticlePubMed
TargetMelanocortin receptor 5(Mus musculus (Mouse))
University Of Florida
Curated by ChEMBL
LigandPNGBDBM50144871(CHEMBL428134)
Affinity DataEC50: >1.00E+5nM. Assay description: Effective concentration against mouse Melanocortin 5 receptor
In DepthDetails ArticlePubMed
TargetMelanocortin receptor 3(Mus musculus)
University Of Florida
Curated by ChEMBL
LigandPNGBDBM50144871(CHEMBL428134)
Affinity DataKd:  8.32nM. Assay description: Effective concentration against mouse Melanocortin 3 receptor
In DepthDetails ArticlePubMed
TargetMelanocortin receptor 4(Mus musculus)
University Of Florida
Curated by ChEMBL
LigandPNGBDBM50144871(CHEMBL428134)
Affinity DataIC50:  29.8nM. Assay description: Inhibitory concentration towards melanocortin MC4 receptor by displacing radioligand [125I]NDP-MSH
In DepthDetails ArticlePubMed