BDBM50146515 (3R,3aS)-7,8-Dimethoxy-3-{4-[3-(2-methoxy-phenyl)-2-methyl-allyl]-piperazin-1-ylmethyl}-3a,4-dihydro-3H-chromeno[4,3-c]isoxazole::CHEMBL99868
SMILES COc1cc2OC[C@H]3[C@H](CN4CCN(C\C(C)=C\c5ccccc5OC)CC4)ON=C3c2cc1OC
InChI Key InChIKey=PYXVPLGVUNHGEJ-VKAKAFFBSA-N
Data  3 KI
  Tab Delimited (TSV)   2D SDfile   Computed 3D by Vconf -m prep SDfile
Find this compound or compounds like it in BindingDB:
Activity Spreadsheet -- Enzyme Inhibition Constant Data from BindingDB
Found 3 hits for monomerid = 50146515
TargetAlpha-2C adrenergic receptor(Homo sapiens (Human))
Janssen-Cilag
Curated by ChEMBL
LigandPNGBDBM50146515((3R,3aS)-7,8-Dimethoxy-3-{4-[3-(2-methoxy-phenyl)-...)
Affinity DataKi:  0.400nM. Assay description: In vitro binding affinity to human alpha-2C adrenergic receptor
In DepthDetails ArticlePubMed
TargetAlpha-2A adrenergic receptor(Homo sapiens (Human))
Janssen-Cilag
Curated by ChEMBL
LigandPNGBDBM50146515((3R,3aS)-7,8-Dimethoxy-3-{4-[3-(2-methoxy-phenyl)-...)
Affinity DataKi:  1nM. Assay description: In vitro binding affinity to the human alpha-2A adrenergic receptor
In DepthDetails ArticlePubMed
TargetSodium-dependent serotonin transporter(Homo sapiens (Human))
Janssen-Cilag
Curated by ChEMBL
LigandPNGBDBM50146515((3R,3aS)-7,8-Dimethoxy-3-{4-[3-(2-methoxy-phenyl)-...)
Affinity DataKi:  1.60nM. Assay description: In vitro binding affinity towards human serotonin transporter
In DepthDetails ArticlePubMed