BDBM50149360 Acetic acid 4-(1,4-dioxo-4,5-dihydro-[1,2,4]triazolo[4,3-a]quinoxalin-2-yl)-phenyl ester::CHEMBL121793
SMILES CC(=O)Oc1ccc(cc1)-n1nc2n(c3ccccc3[nH]c2=O)c1=O
InChI Key InChIKey=TZTWHGNQXQXGGR-UHFFFAOYSA-N
Data  5 KI
  Tab Delimited (TSV)   2D SDfile   Computed 3D by Vconf -m prep SDfile
Find this compound or compounds like it in BindingDB:
Activity Spreadsheet -- Enzyme Inhibition Constant Data from BindingDB
Found 5 hits for monomerid = 50149360
TargetAdenosine receptor A3(Homo sapiens (Human))
Universit£
Curated by ChEMBL
LigandPNGBDBM50149360(Acetic acid 4-(1,4-dioxo-4,5-dihydro-[1,2,4]triazo...)
Affinity DataKi:  11nM. Assay description: Binding affinity against human adenosine A3 receptor expressed in CHO cells by [125I]AB-MECA displacement.
In DepthDetails ArticlePubMed
TargetAdenosine receptor A1(BOVINE)
Universit£
Curated by ChEMBL
LigandPNGBDBM50149360(Acetic acid 4-(1,4-dioxo-4,5-dihydro-[1,2,4]triazo...)
Affinity DataKi:  26nM. Assay description: Binding affinity against adenosine A1 receptor in bovine brain membranes by [3H]CHA displacement.
In DepthDetails ArticlePubMed
TargetAdenosine receptor A1(Homo sapiens (Human))
Universit£
Curated by ChEMBL
LigandPNGBDBM50149360(Acetic acid 4-(1,4-dioxo-4,5-dihydro-[1,2,4]triazo...)
Affinity DataKi:  320nM. Assay description: Binding affinity against human adenosine A1 receptor expressed in CHO cells using [3H]CHA
In DepthDetails ArticlePubMed
TargetAdenosine receptor A2a(Homo sapiens (Human))
Universit£
Curated by ChEMBL
LigandPNGBDBM50149360(Acetic acid 4-(1,4-dioxo-4,5-dihydro-[1,2,4]triazo...)
Affinity DataKi:  9.70E+3nM. Assay description: Displacement of [3H]-CGS- 21680 from adenosine A2a receptor of bovine striatal membranes
In DepthDetails ArticlePubMed
TargetAdenosine receptor A3(Homo sapiens (Human))
Universit£
Curated by ChEMBL
LigandPNGBDBM50149360(Acetic acid 4-(1,4-dioxo-4,5-dihydro-[1,2,4]triazo...)
Affinity DataKi:  4.95E+6nM. Assay description: Displacement of specific [125I]AB-MECA binding at human Adenosine A3 receptor expressed in CHO cells
In DepthDetails ArticlePubMed