BDBM50149368 2-(4-Ethoxy-phenyl)-2H,5H-[1,2,4]triazolo[4,3-a]quinoxaline-1,4-dione::CHEMBL120602
SMILES CCOc1ccc(cc1)-n1nc2n(c3ccccc3[nH]c2=O)c1=O
InChI Key InChIKey=TVPHILZLUXXDKM-UHFFFAOYSA-N
Data  3 KI
  Tab Delimited (TSV)   2D SDfile   Computed 3D by Vconf -m prep SDfile
Find this compound or compounds like it in BindingDB:
Activity Spreadsheet -- Enzyme Inhibition Constant Data from BindingDB
Found 3 hits for monomerid = 50149368
TargetAdenosine receptor A3(Homo sapiens (Human))
Universit£
Curated by ChEMBL
LigandPNGBDBM50149368(2-(4-Ethoxy-phenyl)-2H,5H-[1,2,4]triazolo[4,3-a]qu...)
Affinity DataKi:  175nM. Assay description: Binding affinity against human adenosine A3 receptor expressed in CHO cells by [125I]AB-MECA displacement.
In DepthDetails ArticlePubMed
TargetAdenosine receptor A1(BOVINE)
Universit£
Curated by ChEMBL
LigandPNGBDBM50149368(2-(4-Ethoxy-phenyl)-2H,5H-[1,2,4]triazolo[4,3-a]qu...)
Affinity DataKi:  1.00E+4nM. Assay description: Binding affinity against adenosine A1 receptor in bovine brain membranes by [3H]CHA displacement.
In DepthDetails ArticlePubMed
TargetAdenosine receptor A3(Homo sapiens (Human))
Universit£
Curated by ChEMBL
LigandPNGBDBM50149368(2-(4-Ethoxy-phenyl)-2H,5H-[1,2,4]triazolo[4,3-a]qu...)
Affinity DataKi:  3.75E+6nM. Assay description: Displacement of specific [125I]AB-MECA binding at human Adenosine A3 receptor expressed in CHO cells
In DepthDetails ArticlePubMed