BDBM50152318 CHEMBL3781261
SMILES COc1ccc(Cc2nnc(Nc3ccc(NC(=O)Nc4ccc(Cl)cc4)cc3)c3ccccc23)cc1
InChI Key InChIKey=XFXPNURJCTUOSL-UHFFFAOYSA-N
Data  1 IC50
  Tab Delimited (TSV)   2D SDfile   Computed 3D by Vconf -m prep SDfile
Find this compound or compounds like it in BindingDB:
Activity Spreadsheet -- Enzyme Inhibition Constant Data from BindingDB
Found 1 hit for monomerid = 50152318
TargetVascular endothelial growth factor receptor 2(Homo sapiens (Human))
Egyptian Russian University
Curated by ChEMBL
LigandPNGBDBM50152318(CHEMBL3781261)
Affinity DataIC50:  114nM. Assay description: Inhibition of recombinant human VEGFR-2 expressed in Spodoptera frugiperda cells after 5 mins by using biotinylated poly-GluTyr (4:1) as substrate by...
In DepthDetails ArticlePubMed