BDBM50152552 4-(2,3-Dichloro-phenyl)-2,4-dioxo-butyric acid::CHEMBL185879
SMILES OC(=O)C(=O)CC(=O)c1cccc(Cl)c1Cl
InChI Key InChIKey=ULJWKEWRQXXYJV-UHFFFAOYSA-N
Data  2 IC50
  Tab Delimited (TSV)   2D SDfile   Computed 3D by Vconf -m prep SDfile
Find this compound or compounds like it in BindingDB:
Activity Spreadsheet -- Enzyme Inhibition Constant Data from BindingDB
Found 2 hits for monomerid = 50152552
TargetDNA excision repair protein ERCC-5(Homo sapiens (Human))
Athersys
Curated by ChEMBL
LigandPNGBDBM50152552(4-(2,3-Dichloro-phenyl)-2,4-dioxo-butyric acid | C...)
Affinity DataIC50:  2.21E+4nM. Assay description: Concentration required for 50% inhibition of Xeroderma pigmentosum G
In DepthDetails ArticlePubMed
TargetFlap endonuclease 1(Homo sapiens (Human))
Athersys
Curated by ChEMBL
LigandPNGBDBM50152552(4-(2,3-Dichloro-phenyl)-2,4-dioxo-butyric acid | C...)
Affinity DataIC50:  1.77E+4nM. Assay description: Concentration required for 50% inhibition of Flap endonuclease-1
In DepthDetails ArticlePubMed