BDBM50152582 CHEMBL3780780
SMILES COc1ccc(Cc2nnc(Nc3ccc(NC(=O)Nc4ccc(cc4)C#N)cc3)c3ccccc23)cc1
InChI Key InChIKey=JZXHSQNPBGSUGD-UHFFFAOYSA-N
Data  1 IC50
  Tab Delimited (TSV)   2D SDfile   Computed 3D by Vconf -m prep SDfile
Find this compound or compounds like it in BindingDB:
Activity Spreadsheet -- Enzyme Inhibition Constant Data from BindingDB
Found 1 hit for monomerid = 50152582
TargetVascular endothelial growth factor receptor 2(Homo sapiens (Human))
Egyptian Russian University
Curated by ChEMBL
LigandPNGBDBM50152582(CHEMBL3780780)
Affinity DataIC50:  381nM. Assay description: Inhibition of recombinant human VEGFR-2 expressed in Spodoptera frugiperda cells after 5 mins by using biotinylated poly-GluTyr (4:1) as substrate by...
In DepthDetails ArticlePubMed