BDBM50153491 CHEMBL3775596
SMILES CCCCC(NC(=O)C(CCC(O)=O)NC(=O)C(CC(C)C)NC(=O)C(NC(=O)C(CCC(O)=O)NC(=O)C(CCCNC(N)=N)NC(=O)C(CC(C)C)NC(=O)C(CC(C)C)NC(=O)C(Cc1cnc[nH]1)NC(=O)C(Cc1ccccc1)NC(=O)C(NC(=O)C(CC(C)C)NC(=O)C(CC(O)=O)NC(C)=O)C(C)O)C(C)C)C(=O)NC(C)C(=O)NC(CCCNC(N)=N)C(=O)NC(C)C(=O)NC(CCC(O)=O)C(=O)NC(CCC(N)=O)C(=O)NC(C)(CC(C)C)C(=O)NC(C)C(=O)NC(CCC(N)=O)C(=O)NC1CCC(=O)NCCCCC(NC(=O)C(Cc2cnc[nH]2)NC(=O)C(C)NC1=O)C(=O)NC(CC(N)=O)C(=O)NC(CCCNC(N)=N)C(=O)NC(CCCCN)C(=O)NC(CC(C)C)C(=O)NC(CCCC)C(=O)NC(CCC(O)=O)C(=O)NC(C)(CC(C)C)C(=O)NC(C(C)CC)C(N)=O
InChI Key InChIKey=YDQPYNOCHUULRC-RDLPVJPMSA-N
Data  2 KI
  Tab Delimited (TSV)   2D SDfile   Computed 3D by Vconf -m prep SDfile
Find this compound or compounds like it in BindingDB:
Activity Spreadsheet -- Enzyme Inhibition Constant Data from BindingDB
Found 2 hits for monomerid = 50153491
TargetCorticotropin-releasing factor receptor 1(Homo sapiens (Human))
Salk Institute
Curated by ChEMBL
LigandPNGBDBM50153491(CHEMBL3775596)
Affinity DataKi:  0.450nM. Assay description: Displacement of [125ITyr0-Glu1,Nle17]-PS-Svg in human CRF-R1 expressed in COS-M6 cells after 90 mins by gamma counting assay
In DepthDetails ArticlePubMed
TargetCorticotropin-releasing factor receptor 2(Mus musculus)
Salk Institute
Curated by ChEMBL
LigandPNGBDBM50153491(CHEMBL3775596)
Affinity DataKi:  0.920nM. Assay description: Displacement of [125ITyr0-Glu1,Nle17]-PS-Svg in mouse CRF-R2 beta expressed in COS-M6 cells after 90 mins by gamma counting assay
In DepthDetails ArticlePubMed