BDBM50153574 CHEMBL3775778
SMILES CCCCC(NC(=O)[C@H](CCC(O)=O)NC(=O)[C@H](CC(C)C)NC(=O)[C@@H](NC(=O)[C@H](CCC(O)=O)NC(=O)[C@H](CCCNC(N)=N)NC(=O)[C@H](CC(C)C)NC(=O)[C@H](CC(C)C)NC(=O)[C@H](Cc1cnc[nH]1)NC(=O)[C@@H](Cc1ccccc1)NC(=O)[C@@H](NC(=O)[C@H](CC(C)C)NC(=O)[C@H](CC(O)=O)NC(C)=O)[C@@H](C)O)C(C)C)C(=O)N[C@@H](C)C(=O)N[C@@H](CCCNC(N)=N)C(=O)N[C@@H](C)C(=O)N[C@@H](CCC(O)=O)C(=O)N[C@@H](CCC(N)=O)C(=O)NC(C)(CC(C)C)C(=O)N[C@@H](C)C(=O)N[C@@H](CCC(N)=O)C(=O)N[C@H]1CCC(=O)NCCCC[C@H](NC(=O)[C@H](Cc2cnc[nH]2)NC(=O)[C@H](C)NC1=O)C(=O)N[C@@H](CC(N)=O)C(=O)N[C@@H](CCCNC(N)=N)C(=O)N[C@@H](CCCCN)C(=O)N[C@@H](CC(C)C)C(=O)NC(CCCC)C(=O)N[C@@H](C)C(=O)NC(C)(CC(C)C)C(=O)N[C@@H]([C@@H](C)CC)C(N)=O
InChI Key InChIKey=GIVRAQSBULHOAR-JVECSKCVSA-N
Data  2 KI
  Tab Delimited (TSV)   2D SDfile   Computed 3D by Vconf -m prep SDfile
Find this compound or compounds like it in BindingDB:
Activity Spreadsheet -- Enzyme Inhibition Constant Data from BindingDB
Found 2 hits for monomerid = 50153574
TargetCorticotropin-releasing factor receptor 2(Mus musculus)
Salk Institute
Curated by ChEMBL
LigandPNGBDBM50153574(CHEMBL3775778)
Affinity DataKi:  0.220nM. Assay description: Displacement of [125ITyr0-Glu1,Nle17]-PS-Svg in mouse CRF-R2 beta expressed in COS-M6 cells after 90 mins by gamma counting assay
In DepthDetails ArticlePubMed
TargetCorticotropin-releasing factor receptor 1(Homo sapiens (Human))
Salk Institute
Curated by ChEMBL
LigandPNGBDBM50153574(CHEMBL3775778)
Affinity DataKi:  0.430nM. Assay description: Displacement of [125ITyr0-Glu1,Nle17]-PS-Svg in human CRF-R1 expressed in COS-M6 cells after 90 mins by gamma counting assay
In DepthDetails ArticlePubMed