BDBM50155844 CHEMBL3787383
SMILES Cc1ccc2n(Cc3cccc(NC(=O)OCCCN4CCOCC4)c3)c(=O)oc2c1
InChI Key InChIKey=LVQSINHNFWLTJU-UHFFFAOYSA-N
Data  1 IC50
  Tab Delimited (TSV)   2D SDfile   Computed 3D by Vconf -m prep SDfile
Find this compound or compounds like it in BindingDB:
Activity Spreadsheet -- Enzyme Inhibition Constant Data from BindingDB
Found 1 hit for monomerid = 50155844
TargetHepatocyte growth factor receptor(Homo sapiens (Human))
Shanghai Institute Of Materia Medica
Curated by ChEMBL
LigandPNGBDBM50155844(CHEMBL3787383)
Affinity DataIC50: <10nM. Assay description: Inhibition of N-terminal 6His-tagged human recombinant c-MET expressed in baculovirus infected Sf21 cells using poly Ala-Glu-Lys-Tyr (6:2:5:1) as sub...
In DepthDetails ArticlePubMed