BDBM50157328 7-(1-Quinolin-4-yl-piperidin-4-ylmethoxy)-3,4-dihydro-1H-isoquinoline-2-carboxamidine; dihydrochloride::CHEMBL535367
SMILES NC(=N)N1CCc2ccc(OCC3CCN(CC3)c3ccnc4ccccc34)cc2C1
InChI Key InChIKey=WQVKYLFBJMWDHZ-UHFFFAOYSA-N
Data  2 IC50
  Tab Delimited (TSV)   2D SDfile   Computed 3D by Vconf -m prep SDfile
Find this compound or compounds like it in BindingDB:
Activity Spreadsheet -- Enzyme Inhibition Constant Data from BindingDB
Found 2 hits for monomerid = 50157328
TargetCoagulation factor X(Homo sapiens (Human))
Central Pharmaceutical Research Institute
Curated by ChEMBL
LigandPNGBDBM50157328(7-(1-Quinolin-4-yl-piperidin-4-ylmethoxy)-3,4-dihy...)
Affinity DataIC50:  420nM. Assay description: Inhibitory concentration against human Coagulation factor X
In DepthDetails ArticlePubMed
TargetProthrombin(Homo sapiens (Human))
Central Pharmaceutical Research Institute
Curated by ChEMBL
LigandPNGBDBM50157328(7-(1-Quinolin-4-yl-piperidin-4-ylmethoxy)-3,4-dihy...)
Affinity DataIC50: >1.00E+4nM. Assay description: Inhibitory concentration against human Coagulation factor II (thrombin)
In DepthDetails ArticlePubMed