BDBM50157331 4-(2-Carbamimidoyl-1,2,3,4-tetrahydro-isoquinolin-7-yloxymethyl)-3,4,5,6-tetrahydro-2H-[1,4'']bipyridinyl-3''-carboxylic acid; di hydrochloride::4-(2-Carbamimidoyl-1,2,3,4-tetrahydro-isoquinolin-7-yloxymethyl)-3,4,5,6-tetrahydro-2H-[1,4']bipyridinyl-3'-carboxylic acid; dihydrochloride::CHEMBL540100
SMILES NC(=N)N1CCc2ccc(OCC3CCN(CC3)c3ccncc3C(O)=O)cc2C1
InChI Key InChIKey=OEDWFECAWWHKKM-UHFFFAOYSA-N
Data  2 IC50
  Tab Delimited (TSV)   2D SDfile   Computed 3D by Vconf -m prep SDfile
Find this compound or compounds like it in BindingDB:
Activity Spreadsheet -- Enzyme Inhibition Constant Data from BindingDB
Found 2 hits for monomerid = 50157331
TargetCoagulation factor X(Homo sapiens (Human))
Central Pharmaceutical Research Institute
Curated by ChEMBL
LigandPNGBDBM50157331(4-(2-Carbamimidoyl-1,2,3,4-tetrahydro-isoquinolin-...)
Affinity DataIC50:  1.98E+3nM. Assay description: Inhibitory concentration against human Coagulation factor X
In DepthDetails ArticlePubMed
TargetProthrombin(Homo sapiens (Human))
Central Pharmaceutical Research Institute
Curated by ChEMBL
LigandPNGBDBM50157331(4-(2-Carbamimidoyl-1,2,3,4-tetrahydro-isoquinolin-...)
Affinity DataIC50: >1.00E+4nM. Assay description: Inhibitory concentration against human Coagulation factor II (thrombin)
In DepthDetails ArticlePubMed