BDBM50158408 CHEMBL3786217
SMILES Cc1ccc2n(CCOc3ccnc4cc(NCCCN5CCOCC5)ccc34)c(=O)oc2c1
InChI Key InChIKey=HRMYECGXSNEINZ-UHFFFAOYSA-N
Data  1 IC50
  Tab Delimited (TSV)   2D SDfile   Computed 3D by Vconf -m prep SDfile
Find this compound or compounds like it in BindingDB:
Activity Spreadsheet -- Enzyme Inhibition Constant Data from BindingDB
Found 1 hit for monomerid = 50158408
TargetHepatocyte growth factor receptor(Homo sapiens (Human))
Shanghai Institute Of Materia Medica
Curated by ChEMBL
LigandPNGBDBM50158408(CHEMBL3786217)
Affinity DataIC50:  6nM. Assay description: Inhibition of recombinant c-MET (unknown origin) using poly (Glu,Tyr) 4:1 as substrate after 60 mins by ELISA
In DepthDetails ArticlePubMed