BDBM50159736 CHEMBL3785515
SMILES CC(C)(C)OC(=O)NCCCC[C@H](NC(=O)[C@@H]1Cc2ccccc2CN1C(=O)CCC(=O)c1ccccc1)C(=O)NCC(c1ccccc1)c1ccccc1
InChI Key InChIKey=GNVWJABJQSHDON-YDAXCOIMSA-N
Data  2 EC50
  Tab Delimited (TSV)   2D SDfile   Computed 3D by Vconf -m prep SDfile
Find this compound or compounds like it in BindingDB:
Activity Spreadsheet -- Enzyme Inhibition Constant Data from BindingDB
Found 2 hits for monomerid = 50159736
TargetC-X-C chemokine receptor type 3(Homo sapiens (Human))
Friedrich-Alexander University
Curated by ChEMBL
LigandPNGBDBM50159736(CHEMBL3785515)
Affinity DataEC50: >1.00E+4nM. Assay description: Positive allosteric modulation of ProLink1-tagged wild type CXCR3 (unknown origin) expressed in HEK293T cells assessed as beta-arrestin-2 recruitment...
In DepthDetails ArticlePubMed
TargetC-X-C chemokine receptor type 3(Homo sapiens (Human))
Friedrich-Alexander University
Curated by ChEMBL
LigandPNGBDBM50159736(CHEMBL3785515)
Affinity DataEC50:  1.32E+3nM. Assay description: Positive allosteric modulation of ProLink1-tagged wild type CXCR3 (unknown origin) expressed in HEK293T cells assessed as beta-arrestin-2 recruitment...
In DepthDetails ArticlePubMed