BDBM50160943 (S)-3-(2-{3-[(4-Methyl-furazan-3-ylmethyl)-amino]-2-oxo-2H-pyrazin-1-yl}-butyrylamino)-4-oxo-4-(5-phenyl-oxazol-2-yl)-butyric acid::CHEMBL179066
SMILES CCC(C(=O)N[C@@H](CC(O)=O)C(=O)c1ncc(o1)-c1ccccc1)n1ccnc(NCc2nonc2C)c1=O
InChI Key InChIKey=NCCIOJYCWRHZMY-ATNAJCNCSA-N
Data  4 IC50
  Tab Delimited (TSV)   2D SDfile   Computed 3D by Vconf -m prep SDfile
Find this compound or compounds like it in BindingDB:
Activity Spreadsheet -- Enzyme Inhibition Constant Data from BindingDB
Found 4 hits for monomerid = 50160943
TargetCaspase-7(Homo sapiens (Human))
Merck Frosst Centre For Therapeutic Research
Curated by ChEMBL
LigandPNGBDBM50160943((S)-3-(2-{3-[(4-Methyl-furazan-3-ylmethyl)-amino]-...)
Affinity DataIC50:  0.75nM. Assay description: Inhibitory concentration against recombinant human caspase-7 in neuronal precursor (NT2) cells
In DepthDetails ArticlePubMed
TargetCaspase-1(Homo sapiens (Human))
Merck Frosst Centre For Therapeutic Research
Curated by ChEMBL
LigandPNGBDBM50160943((S)-3-(2-{3-[(4-Methyl-furazan-3-ylmethyl)-amino]-...)
Affinity DataIC50:  0.460nM. Assay description: Inhibitory concentration against recombinant human caspase-1 in neuronal precursor (NT2) cells
In DepthDetails ArticlePubMed
TargetCaspase-8(Homo sapiens (Human))
Merck Frosst Centre For Therapeutic Research
Curated by ChEMBL
LigandPNGBDBM50160943((S)-3-(2-{3-[(4-Methyl-furazan-3-ylmethyl)-amino]-...)
Affinity DataIC50:  9.60nM. Assay description: Inhibitory concentration against recombinant human caspase-8 in neuronal precursor (NT2) cells
In DepthDetails ArticlePubMed
TargetCaspase-3(Homo sapiens (Human))
Merck Frosst Centre For Therapeutic Research
Curated by ChEMBL
LigandPNGBDBM50160943((S)-3-(2-{3-[(4-Methyl-furazan-3-ylmethyl)-amino]-...)
Affinity DataIC50:  0.0630nM. Assay description: Inhibitory concentration against recombinant human caspase-3 in neuronal precursor (NT2) cells
In DepthDetails ArticlePubMed