BDBM50160963 (S)-5-Benzylsulfanyl-3-(2-{3-[(5-methyl-[1,2,4]oxadiazol-3-ylmethyl)-amino]-2-oxo-2H-pyrazin-1-yl}-butyrylamino)-4-oxo-pentanoic acid::CHEMBL178280
SMILES CCC(C(=O)N[C@@H](CC(O)=O)C(=O)CSCc1ccccc1)n1ccnc(NCc2noc(C)n2)c1=O
InChI Key InChIKey=VBXOCZFAWPHIJQ-ZENAZSQFSA-N
Data  4 IC50
  Tab Delimited (TSV)   2D SDfile   Computed 3D by Vconf -m prep SDfile
Find this compound or compounds like it in BindingDB:
Activity Spreadsheet -- Enzyme Inhibition Constant Data from BindingDB
Found 4 hits for monomerid = 50160963
TargetCaspase-3(Homo sapiens (Human))
Merck Frosst Centre For Therapeutic Research
Curated by ChEMBL
LigandPNGBDBM50160963((S)-5-Benzylsulfanyl-3-(2-{3-[(5-methyl-[1,2,4]oxa...)
Affinity DataIC50:  0.0720nM. Assay description: Inhibitory concentration against recombinant human caspase-3 in neuronal precursor (NT2) cells
In DepthDetails ArticlePubMed
TargetCaspase-1(Homo sapiens (Human))
Merck Frosst Centre For Therapeutic Research
Curated by ChEMBL
LigandPNGBDBM50160963((S)-5-Benzylsulfanyl-3-(2-{3-[(5-methyl-[1,2,4]oxa...)
Affinity DataIC50:  1.10nM. Assay description: Inhibitory concentration against recombinant human caspase-1 in neuronal precursor (NT2) cells
In DepthDetails ArticlePubMed
TargetCaspase-7(Homo sapiens (Human))
Merck Frosst Centre For Therapeutic Research
Curated by ChEMBL
LigandPNGBDBM50160963((S)-5-Benzylsulfanyl-3-(2-{3-[(5-methyl-[1,2,4]oxa...)
Affinity DataIC50: >10nM. Assay description: Inhibitory concentration against recombinant human caspase-7 in neuronal precursor (NT2) cells
In DepthDetails ArticlePubMed
TargetCaspase-8(Homo sapiens (Human))
Merck Frosst Centre For Therapeutic Research
Curated by ChEMBL
LigandPNGBDBM50160963((S)-5-Benzylsulfanyl-3-(2-{3-[(5-methyl-[1,2,4]oxa...)
Affinity DataIC50:  7.60nM. Assay description: Inhibitory concentration against recombinant human caspase-8 in neuronal precursor (NT2) cells
In DepthDetails ArticlePubMed