BDBM50161010 CHEMBL3785106
SMILES COC(=O)c1ccc2n(CCOc3ccnc4cc(OC)ccc34)c(=O)oc2c1
InChI Key InChIKey=AWXBDUDWVLVISH-UHFFFAOYSA-N
Data  1 IC50
  Tab Delimited (TSV)   2D SDfile   Computed 3D by Vconf -m prep SDfile
Find this compound or compounds like it in BindingDB:
Activity Spreadsheet -- Enzyme Inhibition Constant Data from BindingDB
Found 1 hit for monomerid = 50161010
TargetHepatocyte growth factor receptor(Homo sapiens (Human))
Shanghai Institute Of Materia Medica
Curated by ChEMBL
LigandPNGBDBM50161010(CHEMBL3785106)
Affinity DataIC50:  34nM. Assay description: Inhibition of recombinant c-MET (unknown origin) using poly (Glu,Tyr) 4:1 as substrate after 60 mins by ELISA
In DepthDetails ArticlePubMed