BDBM50161011 CHEMBL3786136
SMILES COCCOc1ccc2c(OCCn3c4ccc(C)cc4oc3=O)ccnc2c1
InChI Key InChIKey=FFVYPXGNFGGTPK-UHFFFAOYSA-N
Data  1 IC50
  Tab Delimited (TSV)   2D SDfile   Computed 3D by Vconf -m prep SDfile
Find this compound or compounds like it in BindingDB:
Activity Spreadsheet -- Enzyme Inhibition Constant Data from BindingDB
Found 1 hit for monomerid = 50161011
TargetHepatocyte growth factor receptor(Homo sapiens (Human))
Shanghai Institute Of Materia Medica
Curated by ChEMBL
LigandPNGBDBM50161011(CHEMBL3786136)
Affinity DataIC50:  3.5nM. Assay description: Inhibition of recombinant c-MET (unknown origin) using poly (Glu,Tyr) 4:1 as substrate after 60 mins by ELISA
In DepthDetails ArticlePubMed