BDBM50161094 CHEMBL3785650
SMILES CN1CCN(CCCOc2ccc3c(OCCn4c5ccc(C)cc5oc4=O)ccnc3c2)CC1
InChI Key InChIKey=ONEZZKHRAZPSRQ-UHFFFAOYSA-N
Data  1 IC50
  Tab Delimited (TSV)   2D SDfile   Computed 3D by Vconf -m prep SDfile
Find this compound or compounds like it in BindingDB:
Activity Spreadsheet -- Enzyme Inhibition Constant Data from BindingDB
Found 1 hit for monomerid = 50161094
TargetHepatocyte growth factor receptor(Homo sapiens (Human))
Shanghai Institute Of Materia Medica
Curated by ChEMBL
LigandPNGBDBM50161094(CHEMBL3785650)
Affinity DataIC50:  5.10nM. Assay description: Inhibition of recombinant c-MET (unknown origin) using poly (Glu,Tyr) 4:1 as substrate after 60 mins by ELISA
In DepthDetails ArticlePubMed