BDBM50161721 CHEMBL3787068
SMILES COC(=O)CC(=O)NC[C@H]1O[C@H]([C@H](O)[C@@H](O)[C@@H]1O)n1cc(Cc2ccc(cc2)C2CC2)c2c(Cl)cccc12
InChI Key InChIKey=KBNLLFFWZMJVBR-QCCXDOPZSA-N
Data  2 EC50
  Tab Delimited (TSV)   2D SDfile   Computed 3D by Vconf -m prep SDfile
Find this compound or compounds like it in BindingDB:
Activity Spreadsheet -- Enzyme Inhibition Constant Data from BindingDB
Found 2 hits for monomerid = 50161721
TargetSodium/glucose cotransporter 1(Homo sapiens (Human))
National Health Research Institutes
Curated by ChEMBL
LigandPNGBDBM50161721(CHEMBL3787068)
Affinity DataEC50:  5.42E+3nM. Assay description: Inhibition of human SGLT1 expressed in CHO-K1 cells assessed as reduction in [14C]AMG uptake after 120 mins by scintillation counting method
In DepthDetails ArticlePubMed
TargetSodium/glucose cotransporter 2(Homo sapiens (Human))
National Health Research Institutes
Curated by ChEMBL
LigandPNGBDBM50161721(CHEMBL3787068)
Affinity DataEC50:  39nM. Assay description: Inhibition of human SGLT2 expressed in CHO-K1 cells assessed as reduction in [14C]AMG uptake after 120 mins by scintillation counting method
In DepthDetails ArticlePubMed