BDBM50165573 CHEMBL3798130
SMILES Brc1ccc(cc1)-c1cnc2nnc(Cc3ccc4ncccc4c3)n2n1
InChI Key InChIKey=REHLIKVJTUUECZ-UHFFFAOYSA-N
Data  1 IC50
  Tab Delimited (TSV)   2D SDfile   Computed 3D by Vconf -m prep SDfile
Find this compound or compounds like it in BindingDB:
Activity Spreadsheet -- Enzyme Inhibition Constant Data from BindingDB
Found 1 hit for monomerid = 50165573
TargetHepatocyte growth factor receptor(Homo sapiens (Human))
Chinese Academy Of Sciences (Cas)
Curated by ChEMBL
LigandPNGBDBM50165573(CHEMBL3798130)
Affinity DataIC50:  4.20nM. Assay description: Inhibition of recombinant c-Met (unknown origin) using poly (Glu, Tyr) 4:1 as substrate incubated for 60 mins by ELISA
In DepthDetails ArticlePubMed