BDBM50167031 (1R,2R,4S,5S,6R)-2-Amino-4-methyl-bicyclo[3.1.0]hexane-2,6-dicarboxylic acid::CHEMBL195500
SMILES C[C@H]1C[C@@](N)([C@@H]2[C@H]1[C@H]2C(O)=O)C(O)=O
InChI Key InChIKey=BQVZICWQBFTOJX-PUMWMYNLSA-N
Data  2 KI  2 EC50
  Tab Delimited (TSV)   2D SDfile   Computed 3D by Vconf -m prep SDfile
Find this compound or compounds like it in BindingDB:
Activity Spreadsheet -- Enzyme Inhibition Constant Data from BindingDB
Found 4 hits for monomerid = 50167031
TargetMetabotropic glutamate receptor 3(Homo sapiens (Human))
Eli Lilly
Curated by ChEMBL
LigandPNGBDBM50167031((1R,2R,4S,5S,6R)-2-Amino-4-methyl-bicyclo[3.1.0]he...)
Affinity DataKi: >1.00E+5nM. Assay description: Displacement of [3H]-341495 binding to membranes expressing recombinant human Metabotropic glutamate receptor 3
In DepthDetails ArticlePubMed
TargetMetabotropic glutamate receptor 2(Homo sapiens (Human))
Eli Lilly
Curated by ChEMBL
LigandPNGBDBM50167031((1R,2R,4S,5S,6R)-2-Amino-4-methyl-bicyclo[3.1.0]he...)
Affinity DataKi: >1.00E+5nM. Assay description: Displacement of [3H]-341495 binding to membranes expressing recombinant human Metabotropic glutamate receptor 2
In DepthDetails ArticlePubMed
TargetMetabotropic glutamate receptor 2(Homo sapiens (Human))
Eli Lilly
Curated by ChEMBL
LigandPNGBDBM50167031((1R,2R,4S,5S,6R)-2-Amino-4-methyl-bicyclo[3.1.0]he...)
Affinity DataEC50: >1.00E+5nM. Assay description: Evaluation of the functional effect on cAMP responses in RGT cells expressing human mGlu2 receptor
In DepthDetails ArticlePubMed
TargetMetabotropic glutamate receptor 3(Homo sapiens (Human))
Eli Lilly
Curated by ChEMBL
LigandPNGBDBM50167031((1R,2R,4S,5S,6R)-2-Amino-4-methyl-bicyclo[3.1.0]he...)
Affinity DataEC50: >1.00E+5nM. Assay description: Evaluation of the functional effect on cAMP responses in RGT cells expressing human mGlu3 receptor
In DepthDetails ArticlePubMed