BDBM50171224 CHEMBL196215::Cyclic sulfamide
SMILES FC(F)(F)CN1C[C@@]2(NS1(=O)=O)[C@H]1CC[C@@H]2Cc2cc(\C=C\CN3CCC(CC3)C(F)(F)F)ccc2C1
InChI Key InChIKey=NKHUILHBYOOZDF-NCOIWELASA-N
Data  2 IC50
  Tab Delimited (TSV)   2D SDfile   Computed 3D by Vconf -m prep SDfile
Find this compound or compounds like it in BindingDB:
Activity Spreadsheet -- Enzyme Inhibition Constant Data from BindingDB
Found 2 hits for monomerid = 50171224
TargetPresenilin-1(Homo sapiens (Human))
Merck Sharp & Dohme Research Laboratories
Curated by ChEMBL
LigandPNGBDBM50171224(CHEMBL196215 | Cyclic sulfamide)
Affinity DataIC50:  0.240nM. Assay description: Inhibition of gamma secretase in human SH-SY5Y cells by HTRF assay
In DepthDetails ArticlePubMed
LigandPNGBDBM50171224(CHEMBL196215 | Cyclic sulfamide)
Affinity DataIC50:  0.5nM. Assay description: Inhibitory concentration against gamma-secretase in whole cell SH-SY5Y assay
In DepthDetails ArticlePubMed