BDBM50172411 CHEMBL3809974
SMILES Nc1ncnc2n([C@@H]3O[C@H](CO)[C@@H](O)[C@H]3O)c(NCc3ccc(cc3)-c3cccnc3)nc12
InChI Key InChIKey=SMRRGNCWJFQTPB-QTQZEZTPSA-N
Data  2 IC50
  Tab Delimited (TSV)   2D SDfile   Computed 3D by Vconf -m prep SDfile
Find this compound or compounds like it in BindingDB:
Activity Spreadsheet -- Enzyme Inhibition Constant Data from BindingDB
Found 2 hits for monomerid = 50172411
TargetSodium/nucleoside cotransporter 2(Rattus norvegicus)
Kissei Pharmaceutical
Curated by ChEMBL
LigandPNGBDBM50172411(CHEMBL3809974)
Affinity DataIC50: >1.00E+5nM. Assay description: Inhibition of rat CNT2 expressed in African green monkey COS7 cells assessed as reduction of [14C]-inosine uptake by liquid scintillation counting an...
In DepthDetails ArticlePubMed
TargetSodium/nucleoside cotransporter 2(Homo sapiens (Human))
Kissei Pharmaceutical
Curated by ChEMBL
LigandPNGBDBM50172411(CHEMBL3809974)
Affinity DataIC50:  1.00E+3nM. Assay description: Inhibition of human CNT2 expressed in African green monkey COS7 cells assessed as reduction of [14C]-inosine uptake by liquid scintillation counting ...
In DepthDetails ArticlePubMed