BDBM50176627 2-(5-(2-(2-phenyloxazol-4-yl)ethoxy)-2,3-dihydro-1H-inden-1-yl)butanoic acid::CHEMBL200746
SMILES CCC(C1CCc2cc(OCCc3coc(n3)-c3ccccc3)ccc12)C(O)=O
InChI Key InChIKey=SCMGKSLIQWBTDQ-UHFFFAOYSA-N
Data  2 EC50
  Tab Delimited (TSV)   2D SDfile   Computed 3D by Vconf -m prep SDfile
Find this compound or compounds like it in BindingDB:
Activity Spreadsheet -- Enzyme Inhibition Constant Data from BindingDB
Found 2 hits for monomerid = 50176627
TargetPeroxisome proliferator-activated receptor alpha(Homo sapiens (Human))
Bayer Research Center
Curated by ChEMBL
LigandPNGBDBM50176627(2-(5-(2-(2-phenyloxazol-4-yl)ethoxy)-2,3-dihydro-1...)
Affinity DataEC50:  383nM. Assay description: Activity against PPAR alpha in human by FRET assay
In DepthDetails ArticlePubMed
TargetPeroxisome proliferator-activated receptor gamma(Homo sapiens (Human))
Bayer Research Center
Curated by ChEMBL
LigandPNGBDBM50176627(2-(5-(2-(2-phenyloxazol-4-yl)ethoxy)-2,3-dihydro-1...)
Affinity DataEC50:  306nM. Assay description: Activity against PPAR gamma in human by FRET assay
In DepthDetails ArticlePubMed