BDBM50176631 2-(5-(2-(5-methyl-2-phenyloxazol-4-yl)ethoxy)-2,3-dihydro-1H-inden-1-yl)butanoic acid::CHEMBL383986
SMILES CCC(C1CCc2cc(OCCc3nc(oc3C)-c3ccccc3)ccc12)C(O)=O
InChI Key InChIKey=XQWUEDSGGNBHSG-UHFFFAOYSA-N
Data  4 EC50
  Tab Delimited (TSV)   2D SDfile   Computed 3D by Vconf -m prep SDfile
Find this compound or compounds like it in BindingDB:
Activity Spreadsheet -- Enzyme Inhibition Constant Data from BindingDB
Found 4 hits for monomerid = 50176631
TargetPeroxisome proliferator-activated receptor alpha(Homo sapiens (Human))
Bayer Research Center
Curated by ChEMBL
LigandPNGBDBM50176631(2-(5-(2-(5-methyl-2-phenyloxazol-4-yl)ethoxy)-2,3-...)
Affinity DataEC50:  141nM. Assay description: Activity against PPAR alpha in human by FRET assay
In DepthDetails ArticlePubMed
TargetPeroxisome proliferator-activated receptor alpha(Homo sapiens (Human))
Bayer Research Center
Curated by ChEMBL
LigandPNGBDBM50176631(2-(5-(2-(5-methyl-2-phenyloxazol-4-yl)ethoxy)-2,3-...)
Affinity DataEC50:  130nM. Assay description: Agonist activity at PPARalpha by FRET assay
In DepthDetails ArticlePubMed
TargetPeroxisome proliferator-activated receptor gamma(Homo sapiens (Human))
Bayer Research Center
Curated by ChEMBL
LigandPNGBDBM50176631(2-(5-(2-(5-methyl-2-phenyloxazol-4-yl)ethoxy)-2,3-...)
Affinity DataEC50:  590nM. Assay description: Agonist activity at GST-tagged human PPARdelta by FRET assay
In DepthDetails ArticlePubMed
TargetPeroxisome proliferator-activated receptor gamma(Homo sapiens (Human))
Bayer Research Center
Curated by ChEMBL
LigandPNGBDBM50176631(2-(5-(2-(5-methyl-2-phenyloxazol-4-yl)ethoxy)-2,3-...)
Affinity DataEC50:  42nM. Assay description: Activity against PPAR gamma in human by FRET assay
In DepthDetails ArticlePubMed