BDBM50176633 2-(5-(2-(2-(2-fluorophenyl)-5-methyloxazol-4-yl)ethoxy)-2,3-dihydro-1H-inden-1-yl)butanoic acid::CHEMBL199432
SMILES CCC(C1CCc2cc(OCCc3nc(oc3C)-c3ccccc3F)ccc12)C(O)=O
InChI Key InChIKey=HPTWYTJROHXJTH-UHFFFAOYSA-N
Data  2 EC50
  Tab Delimited (TSV)   2D SDfile   Computed 3D by Vconf -m prep SDfile
Find this compound or compounds like it in BindingDB:
Activity Spreadsheet -- Enzyme Inhibition Constant Data from BindingDB
Found 2 hits for monomerid = 50176633
TargetPeroxisome proliferator-activated receptor gamma(Homo sapiens (Human))
Bayer Research Center
Curated by ChEMBL
LigandPNGBDBM50176633(2-(5-(2-(2-(2-fluorophenyl)-5-methyloxazol-4-yl)et...)
Affinity DataEC50:  49nM. Assay description: Activity against PPAR gamma in human by FRET assay
In DepthDetails ArticlePubMed
TargetPeroxisome proliferator-activated receptor alpha(Homo sapiens (Human))
Bayer Research Center
Curated by ChEMBL
LigandPNGBDBM50176633(2-(5-(2-(2-(2-fluorophenyl)-5-methyloxazol-4-yl)et...)
Affinity DataEC50:  559nM. Assay description: Activity against PPAR alpha in human by FRET assay
In DepthDetails ArticlePubMed