BDBM50176635 (S)-2-((R)-5-(2-(5-methyl-2-p-tolyloxazol-4-yl)ethoxy)-2,3-dihydro-1H-inden-1-yl)butanoic acid::CHEMBL200908
SMILES CC[C@@H]([C@H]1CCc2cc(OCCc3nc(oc3C)-c3ccc(C)cc3)ccc12)C(O)=O
InChI Key InChIKey=PVTZPAMEGKOLDH-JTHBVZDNSA-N
Data  2 EC50
  Tab Delimited (TSV)   2D SDfile   Computed 3D by Vconf -m prep SDfile
Find this compound or compounds like it in BindingDB:
Activity Spreadsheet -- Enzyme Inhibition Constant Data from BindingDB
Found 2 hits for monomerid = 50176635
TargetPeroxisome proliferator-activated receptor gamma(Homo sapiens (Human))
Bayer Research Center
Curated by ChEMBL
LigandPNGBDBM50176635((S)-2-((R)-5-(2-(5-methyl-2-p-tolyloxazol-4-yl)eth...)
Affinity DataEC50:  83nM. Assay description: Activity against PPAR gamma in human by FRET assay
In DepthDetails ArticlePubMed
TargetPeroxisome proliferator-activated receptor alpha(Homo sapiens (Human))
Bayer Research Center
Curated by ChEMBL
LigandPNGBDBM50176635((S)-2-((R)-5-(2-(5-methyl-2-p-tolyloxazol-4-yl)eth...)
Affinity DataEC50:  48nM. Assay description: Activity against PPAR alpha in human by FRET assay
In DepthDetails ArticlePubMed