BDBM50176651 2-(5-(2-(5-methyl-2-phenyloxazol-4-yl)ethoxy)-2,3-dihydro-1H-inden-1-yl)-5-phenylpentanoic acid::CHEMBL382928
SMILES Cc1oc(nc1CCOc1ccc2C(CCc2c1)C(CCCc1ccccc1)C(O)=O)-c1ccccc1
InChI Key InChIKey=NOFKKQONAUJXIN-UHFFFAOYSA-N
Data  2 EC50
  Tab Delimited (TSV)   2D SDfile   Computed 3D by Vconf -m prep SDfile
Find this compound or compounds like it in BindingDB:
Activity Spreadsheet -- Enzyme Inhibition Constant Data from BindingDB
Found 2 hits for monomerid = 50176651
TargetPeroxisome proliferator-activated receptor gamma(Homo sapiens (Human))
Bayer Research Center
Curated by ChEMBL
LigandPNGBDBM50176651(2-(5-(2-(5-methyl-2-phenyloxazol-4-yl)ethoxy)-2,3-...)
Affinity DataEC50:  3.18E+3nM. Assay description: Activity against PPAR gamma in human by FRET assay
In DepthDetails ArticlePubMed
TargetPeroxisome proliferator-activated receptor alpha(Homo sapiens (Human))
Bayer Research Center
Curated by ChEMBL
LigandPNGBDBM50176651(2-(5-(2-(5-methyl-2-phenyloxazol-4-yl)ethoxy)-2,3-...)
Affinity DataEC50: >1.00E+4nM. Assay description: Activity against PPAR alpha in human by FRET assay
In DepthDetails ArticlePubMed